{"text_format":"1","workbook":"xlsx","n_sheets":3,"sheets":["INSTRUCTIONS","CADD_DATA","CORNER NAME"],"not_rendered":{"charts":0,"images":0,"macros":1,"external_links":0,"defined_names":290,"comments":0,"pivot_tables":0},"unopened":[],"bounds":{"document_bytes":16777216,"sheet_cells":100000,"rows_first":2000,"rows_last":500,"rows_between":2000,"halvings":0,"cell_chars":16384,"cell_head_chars":4096},"cells_cut":0,"cells_raw":0,"read":"whole","date_system":"1900"}

{"sheet":"INSTRUCTIONS","index":0,"n_rows":30,"n_cols":3,"rows_kept":30,"cut":false,"hidden":false,"merged":[[40,10,41,12],[29,2,37,8],[22,2,23,8]]}
[]
[]
[]
[null,"Step 1:","Rename \"CORNER NAME\" tab after corner to be designed"]
[null,"Step 2:","List all points, i.e., design nodes, of proposed design in Table 1 "]
[null,"Step 3:","List all segments of proposed design in Table 2"]
[null,"Step 4:","Define types of each segment"]
["*","Step 5: ","Overwrite slope ranges (as needed)"]
[null,"Step 6:","Define slope direction (as needed)"]
[null,"Step 7:","Click \"CALCULATE\" button"]
[null,"Step 8:","QA/QC results"]
[]
[]
[]
[]
[]
[]
[]
[]
[]
{"$rows_left_out":11}
{"sheet":"CADD_DATA","index":1,"n_rows":1000,"n_cols":9,"rows_kept":1000,"cut":false,"hidden":false,"merged":[]}
["Point","Station","Offset","Northing","Easting","Elevation","Feature",null,"Output"]
[null,null,null,null,null,null,null,null,{"$f":"IF(LEN(A2)=5,CONCATENATE(A2,\",\",D2,\",\",E2,\",\",F2,\",\",G2),IF(ISBLANK(A2),\"\",CONCATENATE(A2,\",\",D2,\",\",E2,\",\",IFERROR(INDEX(INDIRECT(LEFT(A2,5)&\"!\"&\"$AC$3:$AC$71\",2),MATCH(MID(A2,7,20),INDIRECT(LEFT(A2,5)&\"!\"&\"$AA$3:$AA$71\",2),0)),F2),\",\",G2)))","v":""}]
[null,null,null,null,null,null,null,null,{"$f":"IF(LEN(A3)=5,CONCATENATE(A3,\",\",D3,\",\",E3,\",\",F3,\",\",G3),IF(ISBLANK(A3),\"\",CONCATENATE(A3,\",\",D3,\",\",E3,\",\",IFERROR(INDEX(INDIRECT(LEFT(A3,5)&\"!\"&\"$AC$3:$AC$71\",2),MATCH(MID(A3,7,20),INDIRECT(LEFT(A3,5)&\"!\"&\"$AA$3:$AA$71\",2),0)),F3),\",\",G3)))","v":""}]
[null,null,null,null,null,null,null,null,""]
[null,null,null,null,null,null,null,null,""]
[null,null,null,null,null,null,null,null,""]
[null,null,null,null,null,null,null,null,""]
[null,null,null,null,null,null,null,null,""]
[null,null,null,null,null,null,null,null,""]
[null,null,null,null,null,null,null,null,""]
[null,null,null,null,null,null,null,null,""]
[null,null,null,null,null,null,null,null,""]
[null,null,null,null,null,null,null,null,""]
[null,null,null,null,null,null,null,null,""]
[null,null,null,null,null,null,null,null,""]
[null,null,null,null,null,null,null,null,""]
[null,null,null,null,null,null,null,null,""]
[null,null,null,null,null,null,null,null,""]
[null,null,null,null,null,null,null,null,""]
[null,null,null,null,null,null,null,null,""]
{"$rows_left_out":981}
{"sheet":"CORNER NAME","index":2,"n_rows":71,"n_cols":56,"rows_kept":71,"cut":false,"hidden":false,"merged":[[0,52,0,55],[1,35,1,39],[1,49,1,50],[2,46,2,47],[18,24,18,25],[19,24,19,25],[3,23,4,25],[3,46,3,47],[0,1,0,5],[0,7,0,18]]}
[null,"TABLE 1. POINTS",null,null,null,null,null,"TABLE 2. SEGMENTS",null,null,null,null,null,null,null,null,null,null,null,null,null,null,null,null,null,null,null,null,null,null,null,null,null,null,null,null,null,null,null,null,null,null,null,null,null,null,null,null,null,null,null,null,"TABLE 3. OUTPUT"]
[null,"Point","Station","Offset (ft)","Elevation (ft)","EX. / PR.",null,"From","To","Type","Max Slope","Min Slope","+/-","MAX","MIN","Slope","Slope","Length","Elev. Diff.",null,{"$f":"SUMIF(U3:U45,\"<>\")/SUMIF(V3:V45,\"<>\")","v":{"$error":"#DIV/0!"}},null,null,null,null,null,"Point","Point as is","Elevation ","Station","Offset","Northing","Easting","Row Index","Point Dup.","Seg. Dup.",null,null,null,null,"Random Seed","Elev. (no round)","Slopes ",null,"Rem. Null",null,null,null,null,"Output",null,null,"Point","STATION","OFFSET","ELEVATION"]
[null,null,{"$f":"IF(ISBLANK(B3),\"\",CONCATENATE(LEFT(IF(AH3=\"\",\"\",INDEX(CADD_DATA!$1:$1048576,AH3,2)),SEARCH(\"+\",IF(AH3=\"\",\"\",INDEX(CADD_DATA!$1:$1048576,AH3,2)))-1)&RIGHT(IF(AH3=\"\",\"\",INDEX(CADD_DATA!$1:$1048576,AH3,2)),5)))","v":""},{"$f":"IF(AH3=\"\",\"\",INDEX(CADD_DATA!$1:$1048576,AH3,3))","v":""},null,"PR",null,null,null,null,null,null,null,{"$f":"IF(AND(ISBLANK(H3),ISBLANK(I3)),0,IF(M3=\"-\",-1*IF(L3=\"\",IFERROR(VLOOKUP(J3,$X$11:$Z$16,3,FALSE),0)/100,L3),IF(K3=\"\",IFERROR(VLOOKUP(J3,$X$11:$Z$16,2,FALSE),0)/100,K3)))","v":0},{"$f":"IF(AND(ISBLANK(H3),ISBLANK(I3)),0,IF(M3=\"-\",-1*IF(K3=\"\",IFERROR(VLOOKUP(J3,$X$11:$Z$16,2,FALSE),0)/100,K3),IF(L3=\"\",IFERROR(VLOOKUP(J3,$X$11:$Z$16,3,FALSE),0)/100,L3)))","v":0},{"$f":"IF(AND(ISBLANK(H3),ISBLANK(I3)),0,(IF((ISBLANK(M3)),(ABS((INDEX($E$3:$E$71,MATCH(I3,$B$3:$B$71,0))-INDEX($E$3:$E$71,MATCH(H3,$B$3:$B$71,0)))/R3)),((INDEX($E$3:$E$71,MATCH(I3,$B$3:$B$71,0))-INDEX($E$3:$E$71,MATCH(H3,$B$3:$B$71,0)))/R3))))","v":0},{"$f":"ROUND(IF(AND(ISBLANK(H3),ISBLANK(I3)),0,((INDEX($E$3:$E$71,MATCH(I3,$B$3:$B$71,0))-INDEX($E$3:$E$71,MATCH(H3,$B$3:$B$71,0)))/R3)),4)","v":0},{"$f":"IF(AND(ISBLANK(H3),ISBLANK(I3)),\" \",SQRT(((VLOOKUP(I3,$AB$3:$AG$71,5,FALSE)-VLOOKUP(H3,$AB$3:$AG$71,5,FALSE))^2)+((VLOOKUP(I3,$AB$3:$AG$71,6,FALSE)-VLOOKUP(H3,$AB$3:$AG$71,6,FALSE))^2)))","v":" "},{"$f":"IF(AND(ISBLANK(H3),ISBLANK(I3)),\" \",P3*R3)","v":" "},null,{"$f":"IF(AND(ISBLANK(H3),ISBLANK(I3)),\"\",ABS(P3*R3)^2)","v":""},{"$f":"IF(AND(ISBLANK(H3),ISBLANK(I3)),\"\",R3)","v":""},null,null,null,null,{"$f":"IF(ISBLANK(B3),\"\",TEXT(B3,\"0\"))","v":""},{"$f":"IF(B3=\"\",\"\",B3)","v":""},{"$f":"IF(E3=0,\"\",E3)","v":""},{"$f":"IF(AH3=\"\",\"\",INDEX(CADD_DATA!$1:$1048576,AH3,2))","v":""},{"$f":"IF(AH3=\"\",\"\",INDEX(CADD_DATA!$1:$1048576,AH3,3))","v":""},{"$f":"IF(AH3=\"\",\"\",INDEX(CADD_DATA!$1:$1048576,AH3,4))","v":""},{"$f":"IF(AH3=\"\",\"\",INDEX(CADD_DATA!$1:$1048576,AH3,5))","v":""},{"$f":"IF(B3=\"\",\"\",MATCH($AU$4&\"_\"&B3,CADD_DATA!A:A,0))","v":""},{"$f":"COUNTIF($B$3:$B$71,B3)","v":0},{"$f":"CONCATENATE(IF(LEN(H3)=1,\"0\"&H3,H3),IF(LEN(I3)=1,\"0\"&I3,I3))","v":""},{"$f":"CONCATENATE(IF(LEN(I3)=1,\"0\"&I3,I3),IF(LEN(H3)=1,\"0\"&H3,H3))","v":""},{"$f":"IF(AND(ISBLANK(H3),ISBLANK(I3)),\"\",COUNTIF($AJ$3:$AJ$71,AJ3))","v":""},{"$f":"IF(AND(ISBLANK(H3),ISBLANK(I3)),\"\",COUNTIF($AK$3:$AK$71,AJ3))","v":""},{"$f":"IF(AND(ISBLANK(H3),ISBLANK(I3)),0,SUM(AL3:AM3))","v":0},{"$f":"ROUND(RAND()*(MAX($E$47:$E$71)-MIN($E$47:$E$71))+MIN($E$47:$E$71),2)","v":0},625.09918977852305,{"$f":"ROUND(IF(AND(ISBLANK(H3),ISBLANK(I3)),0,((INDEX($AP$3:$AP$71,MATCH(I3,$B$3:$B$71,0))-INDEX($AP$3:$AP$71,MATCH(H3,$B$3:$B$71,0)))/R3)),4)","v":0},{"$f":"IF(IF(M3=\"\",AND(ABS(AQ3)>=ABS(O3),ABS(AQ3)<=N3),AND(AQ3+100<=N3+100,AQ3+100>=O3+100))=TRUE,TRUE,FALSE)","v":true},{"$f":"IF(B3=\"\",0,E3)","v":0},null,"ADA CORNER",null,null,"STATION","OFFSET",null,{"$f":"AA3","v":""},{"$f":"IF($BB$2=\"NORTHING\",INDEX($AF$3:$AF$71,MATCH(BA3,$AA$3:$AA$71,0)),IF($BB$2=\"STATION\",INDEX($AD$3:$AD$71,MATCH(BA3,$AA$3:$AA$71,0)),\"\"))","v":""},{"$f":"IF($BC$2=\"EASTING\",INDEX($AG$3:$AG$71,MATCH(BA3,$AA$3:$AA$71,0)),IF($BC$2=\"OFFSET\",INDEX($AE$3:$AE$71,MATCH(BA3,$AA$3:$AA$71,0)),\"\"))","v":""},{"$f":"IF(BA3=\"\",\"\",AC3)","v":""}]
[null,null,{"$f":"IF(ISBLANK(B4),\"\",CONCATENATE(LEFT(IF(AH4=\"\",\"\",INDEX(CADD_DATA!$1:$1048576,AH4,2)),SEARCH(\"+\",IF(AH4=\"\",\"\",INDEX(CADD_DATA!$1:$1048576,AH4,2)))-1)&RIGHT(IF(AH4=\"\",\"\",INDEX(CADD_DATA!$1:$1048576,AH4,2)),5)))","v":""},{"$f":"IF(AH4=\"\",\"\",INDEX(CADD_DATA!$1:$1048576,AH4,3))","v":""},null,"PR",null,null,null,null,null,null,null,0,0,{"$f":"IF(AND(ISBLANK(H4),ISBLANK(I4)),0,(IF((ISBLANK(M4)),(ABS((INDEX($E$3:$E$71,MATCH(I4,$B$3:$B$71,0))-INDEX($E$3:$E$71,MATCH(H4,$B$3:$B$71,0)))/R4)),((INDEX($E$3:$E$71,MATCH(I4,$B$3:$B$71,0))-INDEX($E$3:$E$71,MATCH(H4,$B$3:$B$71,0)))/R4))))","v":0},{"$f":"ROUND(IF(AND(ISBLANK(H4),ISBLANK(I4)),0,((INDEX($E$3:$E$71,MATCH(I4,$B$3:$B$71,0))-INDEX($E$3:$E$71,MATCH(H4,$B$3:$B$71,0)))/R4)),4)","v":0},{"$f":"IF(AND(ISBLANK(H4),ISBLANK(I4)),\" \",SQRT(((VLOOKUP(I4,$AB$3:$AG$71,5,FALSE)-VLOOKUP(H4,$AB$3:$AG$71,5,FALSE))^2)+((VLOOKUP(I4,$AB$3:$AG$71,6,FALSE)-VLOOKUP(H4,$AB$3:$AG$71,6,FALSE))^2)))","v":" "}," ",null,{"$f":"IF(AND(ISBLANK(H4),ISBLANK(I4)),\"\",ABS(P4*R4)^2)","v":""},"",null,{"$f":"IF(COUNTIF(AR3:AR45,FALSE)>0,\"VIOLATES USER SPECIFIED PARAMETERS, SEE MANUAL (STEP 4)\", \"MEETS USER SPECIFIED PARAMETERS,\nCHECK FOR ROUNDING ERROR\")","v":"MEETS USER SPECIFIED PARAMETERS,\nCHECK FOR ROUNDING ERROR"},null,null,{"$f":"IF(ISBLANK(B4),\"\",TEXT(B4,\"0\"))","v":""},{"$f":"IF(B4=\"\",\"\",B4)","v":""},"",{"$f":"IF(AH4=\"\",\"\",INDEX(CADD_DATA!$1:$1048576,AH4,2))","v":""},{"$f":"IF(AH4=\"\",\"\",INDEX(CADD_DATA!$1:$1048576,AH4,3))","v":""},{"$f":"IF(AH4=\"\",\"\",INDEX(CADD_DATA!$1:$1048576,AH4,4))","v":""},{"$f":"IF(AH4=\"\",\"\",INDEX(CADD_DATA!$1:$1048576,AH4,5))","v":""},{"$f":"IF(B4=\"\",\"\",MATCH($AU$4&\"_\"&B4,CADD_DATA!A:A,0))","v":""},0,{"$f":"CONCATENATE(IF(LEN(H4)=1,\"0\"&H4,H4),IF(LEN(I4)=1,\"0\"&I4,I4))","v":""},{"$f":"CONCATENATE(IF(LEN(I4)=1,\"0\"&I4,I4),IF(LEN(H4)=1,\"0\"&H4,H4))","v":""},"",{"$f":"IF(AND(ISBLANK(H4),ISBLANK(I4)),\"\",COUNTIF($AK$3:$AK$71,AJ4))","v":""},{"$f":"IF(AND(ISBLANK(H4),ISBLANK(I4)),0,SUM(AL4:AM4))","v":0},{"$f":"ROUND(RAND()*(MAX($E$47:$E$71)-MIN($E$47:$E$71))+MIN($E$47:$E$71),2)","v":0},625.11969923403001,0,true,{"$f":"IF(B4=\"\",0,E4)","v":0},null,{"$f":"MID(CELL(\"filename\",B1),FIND(\"]\",CELL(\"filename\",B1))+1,10)","v":"CORNER NAM"},null,null,"NORTHING","EASTING",null,"","","",{"$f":"IF(BA4=\"\",\"\",AC4)","v":""}]
[null,null,{"$f":"IF(ISBLANK(B5),\"\",CONCATENATE(LEFT(IF(AH5=\"\",\"\",INDEX(CADD_DATA!$1:$1048576,AH5,2)),SEARCH(\"+\",IF(AH5=\"\",\"\",INDEX(CADD_DATA!$1:$1048576,AH5,2)))-1)&RIGHT(IF(AH5=\"\",\"\",INDEX(CADD_DATA!$1:$1048576,AH5,2)),5)))","v":""},{"$f":"IF(AH5=\"\",\"\",INDEX(CADD_DATA!$1:$1048576,AH5,3))","v":""},null,"PR",null,null,null,null,null,null,null,0,0,0,0," "," ",null,"","",null,null,null,null,"","","",{"$f":"IF(AH5=\"\",\"\",INDEX(CADD_DATA!$1:$1048576,AH5,2))","v":""},{"$f":"IF(AH5=\"\",\"\",INDEX(CADD_DATA!$1:$1048576,AH5,3))","v":""},{"$f":"IF(AH5=\"\",\"\",INDEX(CADD_DATA!$1:$1048576,AH5,4))","v":""},{"$f":"IF(AH5=\"\",\"\",INDEX(CADD_DATA!$1:$1048576,AH5,5))","v":""},{"$f":"IF(B5=\"\",\"\",MATCH($AU$4&\"_\"&B5,CADD_DATA!A:A,0))","v":""},0,"","","","",{"$f":"IF(AND(ISBLANK(H5),ISBLANK(I5)),0,SUM(AL5:AM5))","v":0},0,625.05989561508295,0,true,0,null,null,null,null,null,null,null,"","","",""]
[null,null,{"$f":"IF(ISBLANK(B6),\"\",CONCATENATE(LEFT(IF(AH6=\"\",\"\",INDEX(CADD_DATA!$1:$1048576,AH6,2)),SEARCH(\"+\",IF(AH6=\"\",\"\",INDEX(CADD_DATA!$1:$1048576,AH6,2)))-1)&RIGHT(IF(AH6=\"\",\"\",INDEX(CADD_DATA!$1:$1048576,AH6,2)),5)))","v":""},{"$f":"IF(AH6=\"\",\"\",INDEX(CADD_DATA!$1:$1048576,AH6,3))","v":""},null,"PR",null,null,null,null,null,null,null,0,0,0,0," "," ",null,"","",null,null,null,null,"","","",{"$f":"IF(AH6=\"\",\"\",INDEX(CADD_DATA!$1:$1048576,AH6,2))","v":""},{"$f":"IF(AH6=\"\",\"\",INDEX(CADD_DATA!$1:$1048576,AH6,3))","v":""},{"$f":"IF(AH6=\"\",\"\",INDEX(CADD_DATA!$1:$1048576,AH6,4))","v":""},{"$f":"IF(AH6=\"\",\"\",INDEX(CADD_DATA!$1:$1048576,AH6,5))","v":""},{"$f":"IF(B6=\"\",\"\",MATCH($AU$4&\"_\"&B6,CADD_DATA!A:A,0))","v":""},0,"","","","",{"$f":"IF(AND(ISBLANK(H6),ISBLANK(I6)),0,SUM(AL6:AM6))","v":0},0,624.92999999999995,0,true,0,null,null,null,null,null,null,null,"","","",""]
[null,null,{"$f":"IF(ISBLANK(B7),\"\",CONCATENATE(LEFT(IF(AH7=\"\",\"\",INDEX(CADD_DATA!$1:$1048576,AH7,2)),SEARCH(\"+\",IF(AH7=\"\",\"\",INDEX(CADD_DATA!$1:$1048576,AH7,2)))-1)&RIGHT(IF(AH7=\"\",\"\",INDEX(CADD_DATA!$1:$1048576,AH7,2)),5)))","v":""},{"$f":"IF(AH7=\"\",\"\",INDEX(CADD_DATA!$1:$1048576,AH7,3))","v":""},null,"PR",null,null,null,null,null,null,null,0,0,0,0," "," ",null,"","",null,null,null,null,"","","",{"$f":"IF(AH7=\"\",\"\",INDEX(CADD_DATA!$1:$1048576,AH7,2))","v":""},{"$f":"IF(AH7=\"\",\"\",INDEX(CADD_DATA!$1:$1048576,AH7,3))","v":""},{"$f":"IF(AH7=\"\",\"\",INDEX(CADD_DATA!$1:$1048576,AH7,4))","v":""},{"$f":"IF(AH7=\"\",\"\",INDEX(CADD_DATA!$1:$1048576,AH7,5))","v":""},{"$f":"IF(B7=\"\",\"\",MATCH($AU$4&\"_\"&B7,CADD_DATA!A:A,0))","v":""},0,{"$f":"CONCATENATE(IF(LEN(H7)=1,\"0\"&H7,H7),IF(LEN(I7)=1,\"0\"&I7,I7))","v":""},{"$f":"CONCATENATE(IF(LEN(I7)=1,\"0\"&I7,I7),IF(LEN(H7)=1,\"0\"&H7,H7))","v":""},"","",{"$f":"IF(AND(ISBLANK(H7),ISBLANK(I7)),0,SUM(AL7:AM7))","v":0},0,625.17999999999995,0,true,0,null,null,null,null,null,null,null,"","","",""]
[null,null,{"$f":"IF(ISBLANK(B8),\"\",CONCATENATE(LEFT(IF(AH8=\"\",\"\",INDEX(CADD_DATA!$1:$1048576,AH8,2)),SEARCH(\"+\",IF(AH8=\"\",\"\",INDEX(CADD_DATA!$1:$1048576,AH8,2)))-1)&RIGHT(IF(AH8=\"\",\"\",INDEX(CADD_DATA!$1:$1048576,AH8,2)),5)))","v":""},{"$f":"IF(AH8=\"\",\"\",INDEX(CADD_DATA!$1:$1048576,AH8,3))","v":""},null,"PR",null,null,null,null,null,null,null,0,0,0,0," "," ",null,"","",null,null,null,null,"","","",{"$f":"IF(AH8=\"\",\"\",INDEX(CADD_DATA!$1:$1048576,AH8,2))","v":""},{"$f":"IF(AH8=\"\",\"\",INDEX(CADD_DATA!$1:$1048576,AH8,3))","v":""},{"$f":"IF(AH8=\"\",\"\",INDEX(CADD_DATA!$1:$1048576,AH8,4))","v":""},{"$f":"IF(AH8=\"\",\"\",INDEX(CADD_DATA!$1:$1048576,AH8,5))","v":""},{"$f":"IF(B8=\"\",\"\",MATCH($AU$4&\"_\"&B8,CADD_DATA!A:A,0))","v":""},0,"","","","",0,0,625.08000000000004,0,true,0,null,null,null,null,null,null,null,"","","",""]
[null,null,{"$f":"IF(ISBLANK(B9),\"\",CONCATENATE(LEFT(IF(AH9=\"\",\"\",INDEX(CADD_DATA!$1:$1048576,AH9,2)),SEARCH(\"+\",IF(AH9=\"\",\"\",INDEX(CADD_DATA!$1:$1048576,AH9,2)))-1)&RIGHT(IF(AH9=\"\",\"\",INDEX(CADD_DATA!$1:$1048576,AH9,2)),5)))","v":""},{"$f":"IF(AH9=\"\",\"\",INDEX(CADD_DATA!$1:$1048576,AH9,3))","v":""},null,"PR",null,null,null,null,null,null,null,0,0,0,0," "," ",null,"","",null,null,null,null,"","","",{"$f":"IF(AH9=\"\",\"\",INDEX(CADD_DATA!$1:$1048576,AH9,2))","v":""},{"$f":"IF(AH9=\"\",\"\",INDEX(CADD_DATA!$1:$1048576,AH9,3))","v":""},{"$f":"IF(AH9=\"\",\"\",INDEX(CADD_DATA!$1:$1048576,AH9,4))","v":""},{"$f":"IF(AH9=\"\",\"\",INDEX(CADD_DATA!$1:$1048576,AH9,5))","v":""},{"$f":"IF(B9=\"\",\"\",MATCH($AU$4&\"_\"&B9,CADD_DATA!A:A,0))","v":""},0,"","","","",0,0,625.08000000000004,0,true,0,null,null,null,null,null,null,null,"","","",""]
[null,null,{"$f":"IF(ISBLANK(B10),\"\",CONCATENATE(LEFT(IF(AH10=\"\",\"\",INDEX(CADD_DATA!$1:$1048576,AH10,2)),SEARCH(\"+\",IF(AH10=\"\",\"\",INDEX(CADD_DATA!$1:$1048576,AH10,2)))-1)&RIGHT(IF(AH10=\"\",\"\",INDEX(CADD_DATA!$1:$1048576,AH10,2)),5)))","v":""},{"$f":"IF(AH10=\"\",\"\",INDEX(CADD_DATA!$1:$1048576,AH10,3))","v":""},null,"PR",null,null,null,null,null,null,null,0,0,0,0," "," ",null,"","",null,"Category","Max","Min","","","",{"$f":"IF(AH10=\"\",\"\",INDEX(CADD_DATA!$1:$1048576,AH10,2))","v":""},{"$f":"IF(AH10=\"\",\"\",INDEX(CADD_DATA!$1:$1048576,AH10,3))","v":""},{"$f":"IF(AH10=\"\",\"\",INDEX(CADD_DATA!$1:$1048576,AH10,4))","v":""},{"$f":"IF(AH10=\"\",\"\",INDEX(CADD_DATA!$1:$1048576,AH10,5))","v":""},{"$f":"IF(B10=\"\",\"\",MATCH($AU$4&\"_\"&B10,CADD_DATA!A:A,0))","v":""},0,"","","","",0,0,624.94000000000005,0,true,0,null,null,null,null,null,null,null,"","","",""]
[null,null,{"$f":"IF(ISBLANK(B11),\"\",CONCATENATE(LEFT(IF(AH11=\"\",\"\",INDEX(CADD_DATA!$1:$1048576,AH11,2)),SEARCH(\"+\",IF(AH11=\"\",\"\",INDEX(CADD_DATA!$1:$1048576,AH11,2)))-1)&RIGHT(IF(AH11=\"\",\"\",INDEX(CADD_DATA!$1:$1048576,AH11,2)),5)))","v":""},{"$f":"IF(AH11=\"\",\"\",INDEX(CADD_DATA!$1:$1048576,AH11,3))","v":""},null,"PR",null,null,null,null,null,null,null,0,0,0,0," "," ",null,"","",null,"Cross Slope",2,0,"","","",{"$f":"IF(AH11=\"\",\"\",INDEX(CADD_DATA!$1:$1048576,AH11,2))","v":""},{"$f":"IF(AH11=\"\",\"\",INDEX(CADD_DATA!$1:$1048576,AH11,3))","v":""},{"$f":"IF(AH11=\"\",\"\",INDEX(CADD_DATA!$1:$1048576,AH11,4))","v":""},{"$f":"IF(AH11=\"\",\"\",INDEX(CADD_DATA!$1:$1048576,AH11,5))","v":""},{"$f":"IF(B11=\"\",\"\",MATCH($AU$4&\"_\"&B11,CADD_DATA!A:A,0))","v":""},0,"","","","",0,0,625.09,0,true,0,null,null,null,null,null,null,null,"","","",""]
[null,null,{"$f":"IF(ISBLANK(B12),\"\",CONCATENATE(LEFT(IF(AH12=\"\",\"\",INDEX(CADD_DATA!$1:$1048576,AH12,2)),SEARCH(\"+\",IF(AH12=\"\",\"\",INDEX(CADD_DATA!$1:$1048576,AH12,2)))-1)&RIGHT(IF(AH12=\"\",\"\",INDEX(CADD_DATA!$1:$1048576,AH12,2)),5)))","v":""},{"$f":"IF(AH12=\"\",\"\",INDEX(CADD_DATA!$1:$1048576,AH12,3))","v":""},null,"PR",null,null,null,null,null,null,null,0,0,0,0," "," ",null,"","",null,"Depressed Curb",7.2,7.1,"","","",{"$f":"IF(AH12=\"\",\"\",INDEX(CADD_DATA!$1:$1048576,AH12,2))","v":""},{"$f":"IF(AH12=\"\",\"\",INDEX(CADD_DATA!$1:$1048576,AH12,3))","v":""},{"$f":"IF(AH12=\"\",\"\",INDEX(CADD_DATA!$1:$1048576,AH12,4))","v":""},{"$f":"IF(AH12=\"\",\"\",INDEX(CADD_DATA!$1:$1048576,AH12,5))","v":""},{"$f":"IF(B12=\"\",\"\",MATCH($AU$4&\"_\"&B12,CADD_DATA!A:A,0))","v":""},0,"","","","",0,0,625.11,0,true,0,null,null,null,null,null,null,null,"","","",""]
[null,null,{"$f":"IF(ISBLANK(B13),\"\",CONCATENATE(LEFT(IF(AH13=\"\",\"\",INDEX(CADD_DATA!$1:$1048576,AH13,2)),SEARCH(\"+\",IF(AH13=\"\",\"\",INDEX(CADD_DATA!$1:$1048576,AH13,2)))-1)&RIGHT(IF(AH13=\"\",\"\",INDEX(CADD_DATA!$1:$1048576,AH13,2)),5)))","v":""},{"$f":"IF(AH13=\"\",\"\",INDEX(CADD_DATA!$1:$1048576,AH13,3))","v":""},null,"PR",null,null,null,null,null,null,null,0,0,0,0," "," ",null,"","",null,"Gutter Flag",5.0999999999999996,4.9000000000000004,"","","",{"$f":"IF(AH13=\"\",\"\",INDEX(CADD_DATA!$1:$1048576,AH13,2))","v":""},{"$f":"IF(AH13=\"\",\"\",INDEX(CADD_DATA!$1:$1048576,AH13,3))","v":""},{"$f":"IF(AH13=\"\",\"\",INDEX(CADD_DATA!$1:$1048576,AH13,4))","v":""},{"$f":"IF(AH13=\"\",\"\",INDEX(CADD_DATA!$1:$1048576,AH13,5))","v":""},{"$f":"IF(B13=\"\",\"\",MATCH($AU$4&\"_\"&B13,CADD_DATA!A:A,0))","v":""},0,"","","","",0,0,624.91999999999996,0,true,0,null,null,null,null,null,null,null,"","","",""]
[null,null,{"$f":"IF(ISBLANK(B14),\"\",CONCATENATE(LEFT(IF(AH14=\"\",\"\",INDEX(CADD_DATA!$1:$1048576,AH14,2)),SEARCH(\"+\",IF(AH14=\"\",\"\",INDEX(CADD_DATA!$1:$1048576,AH14,2)))-1)&RIGHT(IF(AH14=\"\",\"\",INDEX(CADD_DATA!$1:$1048576,AH14,2)),5)))","v":""},{"$f":"IF(AH14=\"\",\"\",INDEX(CADD_DATA!$1:$1048576,AH14,3))","v":""},null,"PR",null,null,null,null,null,null,null,0,0,0,0," "," ",null,"","",null,"Landing",2,0,"","","",{"$f":"IF(AH14=\"\",\"\",INDEX(CADD_DATA!$1:$1048576,AH14,2))","v":""},{"$f":"IF(AH14=\"\",\"\",INDEX(CADD_DATA!$1:$1048576,AH14,3))","v":""},{"$f":"IF(AH14=\"\",\"\",INDEX(CADD_DATA!$1:$1048576,AH14,4))","v":""},{"$f":"IF(AH14=\"\",\"\",INDEX(CADD_DATA!$1:$1048576,AH14,5))","v":""},{"$f":"IF(B14=\"\",\"\",MATCH($AU$4&\"_\"&B14,CADD_DATA!A:A,0))","v":""},0,"","","","",0,0,625.15,0,true,0,null,null,null,null,null,null,null,"","","",""]
[null,null,{"$f":"IF(ISBLANK(B15),\"\",CONCATENATE(LEFT(IF(AH15=\"\",\"\",INDEX(CADD_DATA!$1:$1048576,AH15,2)),SEARCH(\"+\",IF(AH15=\"\",\"\",INDEX(CADD_DATA!$1:$1048576,AH15,2)))-1)&RIGHT(IF(AH15=\"\",\"\",INDEX(CADD_DATA!$1:$1048576,AH15,2)),5)))","v":""},{"$f":"IF(AH15=\"\",\"\",INDEX(CADD_DATA!$1:$1048576,AH15,3))","v":""},null,"PR",null,null,null,null,null,null,null,0,0,0,0," "," ",null,"","",null,"Ramp",8.3000000000000007,0,"","","",{"$f":"IF(AH15=\"\",\"\",INDEX(CADD_DATA!$1:$1048576,AH15,2))","v":""},{"$f":"IF(AH15=\"\",\"\",INDEX(CADD_DATA!$1:$1048576,AH15,3))","v":""},{"$f":"IF(AH15=\"\",\"\",INDEX(CADD_DATA!$1:$1048576,AH15,4))","v":""},{"$f":"IF(AH15=\"\",\"\",INDEX(CADD_DATA!$1:$1048576,AH15,5))","v":""},{"$f":"IF(B15=\"\",\"\",MATCH($AU$4&\"_\"&B15,CADD_DATA!A:A,0))","v":""},0,"","","","",0,0,625.04999999999995,0,true,0,null,null,null,null,null,null,null,"","","",""]
[null,null,{"$f":"IF(ISBLANK(B16),\"\",CONCATENATE(LEFT(IF(AH16=\"\",\"\",INDEX(CADD_DATA!$1:$1048576,AH16,2)),SEARCH(\"+\",IF(AH16=\"\",\"\",INDEX(CADD_DATA!$1:$1048576,AH16,2)))-1)&RIGHT(IF(AH16=\"\",\"\",INDEX(CADD_DATA!$1:$1048576,AH16,2)),5)))","v":""},{"$f":"IF(AH16=\"\",\"\",INDEX(CADD_DATA!$1:$1048576,AH16,3))","v":""},null,"PR",null,null,null,null,null,null,null,0,0,0,0," "," ",null,"","",null,"Sidewalk",5,0,"","","",{"$f":"IF(AH16=\"\",\"\",INDEX(CADD_DATA!$1:$1048576,AH16,2))","v":""},{"$f":"IF(AH16=\"\",\"\",INDEX(CADD_DATA!$1:$1048576,AH16,3))","v":""},{"$f":"IF(AH16=\"\",\"\",INDEX(CADD_DATA!$1:$1048576,AH16,4))","v":""},{"$f":"IF(AH16=\"\",\"\",INDEX(CADD_DATA!$1:$1048576,AH16,5))","v":""},{"$f":"IF(B16=\"\",\"\",MATCH($AU$4&\"_\"&B16,CADD_DATA!A:A,0))","v":""},0,"","","","",0,0,625.15,0,true,0,null,null,null,null,null,null,null,"","","",""]
[null,null,{"$f":"IF(ISBLANK(B17),\"\",CONCATENATE(LEFT(IF(AH17=\"\",\"\",INDEX(CADD_DATA!$1:$1048576,AH17,2)),SEARCH(\"+\",IF(AH17=\"\",\"\",INDEX(CADD_DATA!$1:$1048576,AH17,2)))-1)&RIGHT(IF(AH17=\"\",\"\",INDEX(CADD_DATA!$1:$1048576,AH17,2)),5)))","v":""},{"$f":"IF(AH17=\"\",\"\",INDEX(CADD_DATA!$1:$1048576,AH17,3))","v":""},null,"PR",null,null,null,null,null,null,null,0,0,0,0," "," ",null,"","",null,null,null,null,"","","",{"$f":"IF(AH17=\"\",\"\",INDEX(CADD_DATA!$1:$1048576,AH17,2))","v":""},{"$f":"IF(AH17=\"\",\"\",INDEX(CADD_DATA!$1:$1048576,AH17,3))","v":""},{"$f":"IF(AH17=\"\",\"\",INDEX(CADD_DATA!$1:$1048576,AH17,4))","v":""},{"$f":"IF(AH17=\"\",\"\",INDEX(CADD_DATA!$1:$1048576,AH17,5))","v":""},{"$f":"IF(B17=\"\",\"\",MATCH($AU$4&\"_\"&B17,CADD_DATA!A:A,0))","v":""},0,"","","","",0,0,624.89,0,true,0,null,null,null,null,null,null,null,"","","",""]
[null,null,{"$f":"IF(ISBLANK(B18),\"\",CONCATENATE(LEFT(IF(AH18=\"\",\"\",INDEX(CADD_DATA!$1:$1048576,AH18,2)),SEARCH(\"+\",IF(AH18=\"\",\"\",INDEX(CADD_DATA!$1:$1048576,AH18,2)))-1)&RIGHT(IF(AH18=\"\",\"\",INDEX(CADD_DATA!$1:$1048576,AH18,2)),5)))","v":""},{"$f":"IF(AH18=\"\",\"\",INDEX(CADD_DATA!$1:$1048576,AH18,3))","v":""},null,"PR",null,null,null,null,null,null,null,0,0,0,0," "," ",null,"","",null,"Legand",null,null,"","","",{"$f":"IF(AH18=\"\",\"\",INDEX(CADD_DATA!$1:$1048576,AH18,2))","v":""},{"$f":"IF(AH18=\"\",\"\",INDEX(CADD_DATA!$1:$1048576,AH18,3))","v":""},{"$f":"IF(AH18=\"\",\"\",INDEX(CADD_DATA!$1:$1048576,AH18,4))","v":""},{"$f":"IF(AH18=\"\",\"\",INDEX(CADD_DATA!$1:$1048576,AH18,5))","v":""},{"$f":"IF(B18=\"\",\"\",MATCH($AU$4&\"_\"&B18,CADD_DATA!A:A,0))","v":""},0,"","","","",0,0,624.95000000000005,0,true,0,null,null,null,null,null,null,null,"","","",""]
[null,null,{"$f":"IF(ISBLANK(B19),\"\",CONCATENATE(LEFT(IF(AH19=\"\",\"\",INDEX(CADD_DATA!$1:$1048576,AH19,2)),SEARCH(\"+\",IF(AH19=\"\",\"\",INDEX(CADD_DATA!$1:$1048576,AH19,2)))-1)&RIGHT(IF(AH19=\"\",\"\",INDEX(CADD_DATA!$1:$1048576,AH19,2)),5)))","v":""},{"$f":"IF(AH19=\"\",\"\",INDEX(CADD_DATA!$1:$1048576,AH19,3))","v":""},null,"PR",null,null,null,null,null,null,null,0,0,0,0," "," ",null,"","",null,null,"ROUNDING ERROR",null,"","","",{"$f":"IF(AH19=\"\",\"\",INDEX(CADD_DATA!$1:$1048576,AH19,2))","v":""},{"$f":"IF(AH19=\"\",\"\",INDEX(CADD_DATA!$1:$1048576,AH19,3))","v":""},{"$f":"IF(AH19=\"\",\"\",INDEX(CADD_DATA!$1:$1048576,AH19,4))","v":""},{"$f":"IF(AH19=\"\",\"\",INDEX(CADD_DATA!$1:$1048576,AH19,5))","v":""},{"$f":"IF(B19=\"\",\"\",MATCH($AU$4&\"_\"&B19,CADD_DATA!A:A,0))","v":""},0,"","","","",0,0,625,0,true,0,null,null,null,null,null,null,null,"","","",""]
[null,null,{"$f":"IF(ISBLANK(B20),\"\",CONCATENATE(LEFT(IF(AH20=\"\",\"\",INDEX(CADD_DATA!$1:$1048576,AH20,2)),SEARCH(\"+\",IF(AH20=\"\",\"\",INDEX(CADD_DATA!$1:$1048576,AH20,2)))-1)&RIGHT(IF(AH20=\"\",\"\",INDEX(CADD_DATA!$1:$1048576,AH20,2)),5)))","v":""},{"$f":"IF(AH20=\"\",\"\",INDEX(CADD_DATA!$1:$1048576,AH20,3))","v":""},null,"PR",null,null,null,null,null,null,null,0,0,0,0," "," ",null,"","",null,null,"VIOLATES SLOPE RANGES",null,"","","",{"$f":"IF(AH20=\"\",\"\",INDEX(CADD_DATA!$1:$1048576,AH20,2))","v":""},{"$f":"IF(AH20=\"\",\"\",INDEX(CADD_DATA!$1:$1048576,AH20,3))","v":""},{"$f":"IF(AH20=\"\",\"\",INDEX(CADD_DATA!$1:$1048576,AH20,4))","v":""},{"$f":"IF(AH20=\"\",\"\",INDEX(CADD_DATA!$1:$1048576,AH20,5))","v":""},{"$f":"IF(B20=\"\",\"\",MATCH($AU$4&\"_\"&B20,CADD_DATA!A:A,0))","v":""},0,"","","","",0,0,624.91,0,true,0,null,null,null,null,null,null,null,"","","",""]
{"$rows_left_out":51}